Message8516
The tests were run in the docker container from stage 1 (the big one that builds stuff), not the final roundup one.
=========================== short test summary info ============================
FAILED test/test_demo.py::TestDemo::testDemoClassic - SystemExit: 2
FAILED test/test_demo.py::TestDemo::testDemoJinja - SystemExit: 2
FAILED test/test_demo.py::TestDemo::testDemoMinimal - SystemExit: 2
FAILED test/test_sqlite.py::sqliteSpecialActionTestCase::testInnerMain - redi...
FAILED test/test_sqlite.py::sqliteSessionTest::testBadTimestamp - redis.excep...
FAILED test/test_sqlite.py::sqliteSessionTest::testClear - redis.exceptions.C...
FAILED test/test_sqlite.py::sqliteSessionTest::testDataTypes - redis.exceptio...
FAILED test/test_sqlite.py::sqliteSessionTest::testDbType - AssertionError: '...
FAILED test/test_sqlite.py::sqliteSessionTest::testDestroy - redis.exceptions...
FAILED test/test_sqlite.py::sqliteSessionTest::testGetAll - redis.exceptions....
FAILED test/test_sqlite.py::sqliteSessionTest::testGetGetAllMissingKey - redi...
FAILED test/test_sqlite.py::sqliteSessionTest::testGetUniqueKey - redis.excep...
FAILED test/test_sqlite.py::sqliteSessionTest::testLifetime - AssertionError:...
FAILED test/test_sqlite.py::sqliteSessionTest::testList - redis.exceptions.Co...
FAILED test/test_sqlite.py::sqliteSessionTest::testSetSession - redis.excepti...
FAILED test/test_sqlite.py::sqliteSessionTest::testUpdateSession - redis.exce...
FAILED test/test_sqlite.py::sqliteSessionTest::testUpdateTimestamp - redis.ex...
FAILED test/test_sqlite.py::sqliteSessionTest::testWalMode - AttributeError: ...
===== 18 failed, 1367 passed, 1003 skipped, 1 xfailed in 575.80s (0:09:35) ===== |
|
| Date |
User |
Action |
Args |
| 2026-09-11 11:09:54 | cf-intevation | set | messageid: <1789124994.88.0.787575970285.issue2551427@roundup-tracker.org> |
| 2026-09-11 11:09:54 | cf-intevation | set | recipients:
+ cf-intevation, schlatterbeck, ber, rouilj |
| 2026-09-11 11:09:54 | cf-intevation | link | issue2551427 messages |
| 2026-09-11 11:09:54 | cf-intevation | create | |
|